Android

Androidエラー

リリースビルドなのに「デバッグ可能な APK または Android App Bundle をアップロードしました」と出る場合の原因


Androidエラー

【Unity/Android】!!! FAILED BINDER TRANSACTION !!! の原因

AndroidStudioでの実機ビルド時に、以下のエラーがたくさん出てきました。!!! FAILED BINDER TRANSACTION !!!エディタで実行してみても正常に動くのに、Android端末実機で実行すると必ずエラーになって...
Unityエラー

Duplicate class android.support.v4.app.XXX found in modules classes.jar … というビルドエラー

UnityでAndroidビルドする際、以下のようなエラーが大量に出てきました。Duplicate class android.support.v4.app.INotificationSideChannel$Stub found in mo...
その他解説

Unityに.keystoreをアップロードしたいのに.jksしかないとき

以前リリースしたUnity製のAndroidアプリをアップデートしようとした時、以前のkeystoreファイルを紛失してしまったことに気づきました。Androidアプリではkeystoreファイルをなくしてしまうと、アップデートができなくな...
Androidエラー

【Unity】64bit対応したはずが「このリリースは Google Play の 64 ビット要件に準拠していません」と表示された

UnityでAndroidビルドしたapkをGooglePlayConsoleにアップロードして公開したところ、以下のように「64bitに対応していない」というエラーが表示されました。エラーこのリリースは Google Play の 64 ...
Unityエラー

TransformExceptionやDexArchiveBuilderExceptionやGradle build failedというAndroidビルドエラー【Unity】

UnityでAndroidビルドする際に起きたエラー。AdMobとNCMBを利用していましたが、NCMBは関係あるかわかりません。com.android.build.api.transform.TransformException:com....
Unityエラー

「Android SDK is missing required platform API」というエラーの解決方法

UnityでAndroidビルド時、以下のエラーダイアログが出ました。Android SDK is missing required platform APIMinimum platform required is Android X.X ...
Unityエラー

Gradle Error: Colliding Attributes The attribute meta-data#android…というエラーの原因と解決方法

UnityプロジェクトをAndroidビルドしようとした時に起こったエラーです。Gradle Error: Colliding Attributes The attribute meta-data#android.support.VERSI...
Unityエラー

ArgumentNullException: Value cannot be null. Parameter name: path1というAndroidビルドエラー

Androidビルド時のエラー。ArgumentNullException: Value cannot be null.Parameter name: path1解決方法以下の記事を参考にしました。単純にUnityを再起動すれば問題なくビル...
Androidエラー

Unity製Android apkをエミュレータや実機にインストールできない場合の解決方法

UnityでAndroidアプリとしてビルドし、エミュレータや実機にapkファイルをインストールしようとした時に起きたエラーです。僕の場合はエミュレータで起こったのですが、調べてみるとどうやら実機でも起こることがあるようです。また、エミュレ...