Build

スポンサーリンク
Unityエラー

IOException: Failed to Copy File / Directory from ‘Temp/StagingArea/Trampoline’ to 〜

UnityでのiOSビルド時に出たエラー。 IOException: Failed to Copy File / Directory from 'Temp/StagingArea/Trampoline' to '/Users/...
Xcodeエラー

Supported orientations has no common orientation with the application…というエラー

UnityでiOSビルドした後にXcodeで実機ビルドした際、以下のエラーが出ました。 UIApplicationInvalidInterfaceOrientation: Supported orientations has ...
Unityエラー

Duplicate class android.support.v4.app.XXX found in modules classes.jar … というビルドエラー

UnityでAndroidビルドする際、以下のようなエラーが大量に出てきました。 Duplicate class android.support.v4.app.INotificationSideChannel$Stub found...
Unityエラー

Exception: /xx/xx/xx/il2cppcore.dll did not run properly! のビルドエラーを解決

UnityでのAndroidビルド時、以下のエラーが出ました。 Exception: /Applications/Unity/Hub/Editor/2019.2.7f2/Unity.app/Contents/il2cpp/build/il2...
Xcodeエラー

66 duplicate symbols for architecture arm64というエラーの原因と解決方法

Unityで作成したiOSビルドファイルをXcodeでビルドした際、下記のエラーが出ました。 66 duplicate symbols for architecture arm64 エラーが出た時点でほぼ間違いな...
Unityエラー

「The type or namespace name ‘Editor’ could not be found」というビルドエラー

Unityでビルドした際、以下のエラーによりビルドが失敗しました。 The type or namespace name 'Editor' could not be found (are you missing a using d...
Unityエラー

TransformExceptionやDexArchiveBuilderExceptionやGradle build failedというAndroidビルドエラー【Unity】

UnityでAndroidビルドする際に起きたエラー。 AdMobとNCMBを利用していましたが、NCMBは関係あるかわかりません。 com.android.build.api.transform.Trans...
Xcodeエラー

Unknown type name ‘GADUTypeNativeExpressAdClientRef’の解消方法

UnityでiOSビルドした際は問題なく通ったものの、Xcodeでビルドしてみると以下のエラーが出ました。 Unknown type name 'GADUTypeNativeExpressAdClientRef' ちなみ...
Xcodeエラー

No known class method for selector ‘positionView:inParentBounds:withAdPosition: の解消方法

UnityでiOSビルドした際は何もエラーが出ず通ったのですが、Xcodeでビルドしてみると以下のエラーが。 No known class method for selector 'positionView:inParentBou...
Unityエラー

「Android SDK is missing required platform API」というエラーの解決方法

UnityでAndroidビルド時、以下のエラーダイアログが出ました。 Android SDK is missing required platform API Minimum platform required is Andr...
タイトルとURLをコピーしました