エラー

スポンサーリンク
Xcodeエラー

アンロック状態なのに「Unlock xxx の iPhone to Continue」が出る【Xcode実機ビルド】

XcodeでiOS実機ビルドした際、端末のロックを解除した状態にもかかわらず、以下のエラーが表示されて実機確認ができませんでした。     Unlock yusuke の iPhone to ContinueXc...
その他エラー

VSCodeでUnityの補完が効かなくなったときの解決方法(OmniSharpの問題)

UnityのコードエディタとしてVSCode(VisualStudioCode)を使っていた時の話。 つい数日前まではいつも通り使えていたのですが、突然Unityの補完が効かなくなってしまいました。   普段なら...
Androidエラー

リリースビルドなのに「デバッグ可能な APK または Android App Bundle をアップロードしました」と出る場合の原因


Xcodeエラー

Unity+NCMB+iOSビルドでlinker command failed with exit code 1のエラー

NCMBを使ったUnityプロジェクトをiOSビルドし、Xcodeで実機ビルドしようとしたときに起きたエラー。 ld: warning: arm64 function not 4-byte aligned: _unwi...
Unityエラー

SceneのロードとDOTweenを同時に使うとWebGLでクラッシュする

UnityでSceneのロードとDOTweenを同時に使うと、WebGLにビルドした際のシーン遷移時にクラッシュするという問題が起こりました。 Unityエディタ上では何の問題もなく動作します。 エラーはこちら。 ...
その他エラー

【解決】SpreadsheetApp.openById を呼び出す権限がありません。というエラー

Google Apps Script(GAS)で、他のスプレッドシートから値を取ってこようとした際に、以下のようなエラーでかなりつまづいたので解決方法を覚え書き。 SpreadsheetApp.openById を呼び出す権限がありませ...
Androidエラー

java.lang.NoClassDefFoundError: Failed resolution of: InterstitialAd の解決方法

AdMob広告を入れたUnityプロジェクトを、Androidビルドして実機起動した場合に発生したエラー。 アプリが広告を表示しようとしたタイミングで、アプリが落ちてしまう状態でした。 java.lang.NoCla...
Androidエラー

【Unity/Android】!!! FAILED BINDER TRANSACTION !!! の原因

AndroidStudioでの実機ビルド時に、以下のエラーがたくさん出てきました。 !!! FAILED BINDER TRANSACTION !!! エディタで実行してみても正常に動くのに、Android端末実機で...
Xcodeエラー

Undefined symbols for architecture arm64: … symbol(s) not found for architecture arm64のエラー

UnityプロジェクトをiOSビルドし、Xcodeで実機ビルドした際、以下のエラーが出ました。 Undefined symbols for architecture arm64: "XXXXXX", referenced...
Unityエラー

Exception: Calling TargetGuidByName with name=’Unity-iPhone’ is deprecated. というエラーの解決方法

UnityでiOSビルドした際に、以下のエラーが出ました。 Exception: Calling TargetGuidByName with name='Unity-iPhone' is deprecated. There a...
タイトルとURLをコピーしました